{"text_format":"1","workbook":"xlsx","n_sheets":3,"sheets":["調査票","DATA","項目リスト"],"not_rendered":{"charts":0,"images":0,"macros":1,"external_links":0,"defined_names":10,"comments":0,"pivot_tables":0},"unopened":[],"bounds":{"document_bytes":16777216,"sheet_cells":100000,"rows_first":2000,"rows_last":500,"rows_between":2000,"halvings":0,"cell_chars":16384,"cell_head_chars":4096},"cells_cut":0,"cells_raw":0,"read":"whole","date_system":"1900"}

{"sheet":"調査票","index":0,"n_rows":202,"n_cols":42,"rows_kept":202,"cut":false,"hidden":false,"merged":[[36,22,36,32],[37,22,37,32],[29,22,29,32],[30,22,30,32],[133,9,133,32],[29,9,29,21],[30,9,30,21],[33,9,33,21],[50,15,50,25],[61,15,61,25],[72,15,72,25],[83,15,83,25],[83,9,83,14],[56,8,56,18],[121,10,121,18],[113,10,113,18],[103,10,103,18],[93,10,93,18],[85,10,85,18],[113,1,113,9],[121,1,121,9],[130,8,130,13],[131,8,131,18],[105,8,105,18],[94,8,94,13],[95,8,95,18],[104,8,104,13],[37,9,37,21],[72,9,72,14],[61,9,61,14],[50,9,50,14],[103,1,103,9],[93,1,93,9],[85,1,85,9],[36,9,36,21],[66,8,66,13],[44,8,44,13],[45,8,45,18],[34,9,34,21],[77,8,77,13],[78,8,78,18],[87,8,87,18],[86,8,86,13],[13,8,16,33],[7,15,7,18],[34,22,34,32],[35,22,35,32],[32,9,32,21],[28,22,28,32],[10,0,10,7],[21,1,21,7],[24,8,24,9],[25,8,25,9],[26,8,26,9],[23,17,23,18],[24,17,24,18],[25,17,25,18],[26,17,26,18],[35,9,35,21],[8,8,8,18],[7,19,7,21],[7,11,7,14],[134,8,134,13],[134,14,135,32],[2,1,2,4],[2,5,2,9],[19,1,19,6],[20,1,20,6],[28,1,28,7],[19,8,19,11],[21,8,21,13],[20,8,20,23],[28,9,28,21],[31,22,31,32],[31,9,31,21],[67,8,67,18],[55,8,55,13],[7,22,7,25],[32,22,32,32],[33,22,33,32],[10,8,10,26],[122,8,122,13],[123,8,123,18],[114,8,114,13],[115,8,115,18],[7,9,7,10],[139,0,140,32],[144,20,144,32],[145,20,145,30],[147,1,148,31],[150,0,150,7],[150,8,150,32],[151,0,154,7],[151,8,154,32],[155,0,156,7],[155,8,156,25],[155,26,156,32],[157,0,167,0],[161,9,161,20],[161,22,161,32],[162,9,162,20],[162,22,162,32],[163,9,163,20],[163,22,163,32],[164,9,164,20],[164,22,164,32],[165,9,165,20],[165,22,165,32],[166,1,167,7],[168,0,169,7],[168,26,168,32],[169,12,169,13],[169,14,169,25],[169,26,171,32],[170,13,170,25],[171,4,171,7],[171,13,171,25],[172,0,173,7],[172,26,172,32],[173,12,173,13],[173,14,173,25],[173,26,175,32],[174,13,174,25],[175,4,175,7],[175,13,175,25],[192,26,192,32],[193,1,193,7],[193,26,194,32],[194,4,194,7],[195,1,195,7],[195,26,195,32],[196,26,197,32],[176,0,177,7],[176,26,176,32],[177,12,177,13],[177,14,177,25],[177,26,179,32],[178,13,178,25],[179,4,179,7],[179,13,179,25],[180,0,181,7],[180,26,180,32],[181,12,181,13],[181,14,181,25],[181,26,182,32],[182,4,182,7],[197,4,197,7],[2,11,2,33],[198,0,199,7],[198,26,198,32],[199,9,199,10],[199,11,200,25],[199,26,200,32],[200,4,200,7],[183,0,197,0],[183,1,183,7],[183,26,183,32],[184,26,185,32],[185,4,185,7],[186,1,186,7],[186,26,186,32],[187,26,188,32],[188,4,188,7],[188,9,188,18],[189,1,189,7],[189,26,189,32],[190,1,190,7],[190,26,191,32],[191,4,191,7],[191,9,191,18],[192,1,192,7]]}
["長期優良住宅　居住環境の維持及び向上への配慮に関する調査票",null,null,null,null,null,null,null,null,null,null,null,null,null,null,null,null,null,null,null,null,null,null,null,null,null,null,null,null,null,null,null,null,"2018/11/9 Ver.1.1"]
[]
[null,"入力",null,null,null,"印刷",null,null,null,null,null,"※このシートは、上部に入力部分、下部に印刷部分の構成になっています。"]
[]
["◆","入力"]
[]
["【調査者】"]
[null,"【資格】",null,null,null,null,null,null,"（",null,null,"）建築士(",null,null,null,null,null,null,null,"）登録第",null,null,null,null,null,null,"号"]
[null,"【氏名】"]
[]
["【申請者名又は住宅の名称】"]
[]
["【住宅の位置】",null,null,null,null,"改行は、[alt]+[Enter]"]
[]
[]
[]
[]
[]
["【調査内容】"]
[null,"【都道府県名】",null,null,null,null,null,null,null,null,null,null,null,null,null,null,null,null,null,null,null,null,null,null,null,null,null,null,null,null,null,null,null,null,null,{"$f":"SUMIF(DATA!F4:F347,I20,DATA!A4:A347)","v":0},null,"特定","限定","旧を含む","市町村の別","郡"]
[null,"【市町村名】",null,null,null,null,null,null,null,null,null,null,null,null,null,null,null,null,null,null,null,null,null,null,null,null,null,null,null,null,null,null,null,null,null,{"$f":"SUMIF(DATA!F4:F347,I21,DATA!A4:A347)","v":0},null,{"$f":"VLOOKUP(AJ21,DATA!$A$4:$AV$347,13,FALSE)","v":{"$error":"#N/A"}},{"$f":"VLOOKUP(AJ21,DATA!$A$4:$AV$347,14,FALSE)","v":{"$error":"#N/A"}},{"$f":"FIND(\"旧\",I21)-2","v":{"$error":"#VALUE!"}},{"$f":"IF(ISERROR(AN21),RIGHT(I21,1),MID(I21,AN21,1))","v":""},{"$f":"IF(OR(AO21=\"町\",AO21=\"村\"),\" \"&VLOOKUP($AJ$21,DATA!$A$4:$AV$347,5,FALSE),\"\")","v":""}]
[null,"【建築基準法６条】",null,null,null,null,null,null,null,null,null,null,null,null,null,null,null,null,null,null,null,null,null,null,null,null,null,null,null,null,null,null,null,null,null,{"$f":"IF(I22=\"１～３号建築物\",1,0)","v":0},null,{"$f":"IF(AL21=0,I20,AL21)","v":{"$error":"#N/A"}},{"$f":"IF(AM21=0,I20,AM21)","v":{"$error":"#N/A"}}]
[]
[null,null,null,null,null,null,null,null,null,null,null,null,null,null,null,null,null,"参考"]
[null,"【断熱地域区分】",null,null,null,null,null,null,null,null,"地域",null,null,null,null,null,null,{"$f":"VLOOKUP($AJ$21,DATA!$A$4:$AV$347,7,FALSE)","v":{"$error":"#N/A"}},null,"地域",null,null,null,null,null,null,null,null,null,null,null,null,null,null,null,{"$f":"IF(I25=R25,0,1)","v":{"$error":"#N/A"}}]
[null,"【基準風速】",null,null,null,null,null,null,null,null,"m/s",null,null,null,null,null,null,{"$f":"IF(VLOOKUP($AJ$21,DATA!$A$4:$AV$347,10,FALSE)=\"\",30,VLOOKUP($AJ$21,DATA!$A$4:$AV$347,10,FALSE))","v":{"$error":"#N/A"}},null,"m/s",null,null,null,null,null,null,null,null,null,null,null,null,null,null,null,{"$f":"IF(I26=R26,0,1)","v":{"$error":"#N/A"}}]
[null,"【垂直積雪量】",null,null,null,null,null,null,null,null,"cm",null,null,null,null,null,null,{"$f":"VLOOKUP($AJ$21,DATA!$A$4:$AV$347,11,FALSE)","v":{"$error":"#N/A"}},null,"cm",null,null,{"$f":"IF(VLOOKUP($AJ$21,DATA!$A$4:$AV$347,12,FALSE)=\"○\",\"多雪地域\",\"\")","v":{"$error":"#N/A"}},null,null,null,null,null,null,null,null,null,null,null,null,{"$f":"IF(I27=R27,0,1)","v":{"$error":"#N/A"}}]
[]
[null,"【建築基準法の許可等】",null,null,null,null,null,null,"□","建築物の敷地と道路との関係の建築許可",null,null,null,null,null,null,null,null,null,null,null,null,"法第４３条第１項",null,null,null,null,null,null,null,null,null,null,null,null,{"$f":"IF(I29=\"■\",1,0)","v":0},null,"所管行政庁名","№"]
[null,null,null,null,null,null,null,null,"□","公衆便所等の道路内における建築許可",null,null,null,null,null,null,null,null,null,null,null,null,"法第４４条第１項第二号",null,null,null,null,null,null,null,null,null,null,null,null,0,null,{"$f":"IF(AJ39>0,AL22,AM22)","v":{"$error":"#N/A"}},{"$f":"IF(RIGHT(AL30,1)=\"県\",AJ20,AJ21)","v":{"$error":"#N/A"}}]
[null,null,null,null,null,null,null,null,"□","公共用歩廊等の道路内における建築許可　",null,null,null,null,null,null,null,null,null,null,null,null,"法第４４条第１項第四号",null,null,null,null,null,null,null,null,null,null,null,null,0]
[null,null,null,null,null,null,null,null,"□","用途地域における建築等許可",null,null,null,null,null,null,null,null,null,null,null,null,"法第４８条各項 ",null,null,null,null,null,null,null,null,null,null,null,null,0]
[null,null,null,null,null,null,null,null,"□","特殊建築物等敷地許可 ",null,null,null,null,null,null,null,null,null,null,null,null,"法第５１条 ",null,null,null,null,null,null,null,null,null,null,null,null,0]
[null,null,null,null,null,null,null,null,"□","機械室等に関する容積率の例外許可",null,null,null,null,null,null,null,null,null,null,null,null,"法第５２条第１４項 ",null,null,null,null,null,null,null,null,null,null,null,null,0]
[null,null,null,null,null,null,null,null,"□","高さ制限の例外許可 ",null,null,null,null,null,null,null,null,null,null,null,null,"法第５５条第３項第一号、第二号 ",null,null,null,null,null,null,null,null,null,null,null,null,0]
[null,null,null,null,null,null,null,null,"□","日影規制の例外許可 ",null,null,null,null,null,null,null,null,null,null,null,null,"法第５６条の２ ",null,null,null,null,null,null,null,null,null,null,null,null,0]
[null,null,null,null,null,null,null,null,"□","総合設計の許可 ",null,null,null,null,null,null,null,null,null,null,null,null,"法第５９条の２ ",null,null,null,null,null,null,null,null,null,null,null,null,0]
[null,null,null,null,null,null,null,null,"□","仮設建築物の建築許可 ",null,null,null,null,null,null,null,null,null,null,null,null,"法第８５条第５項 ",null,null,null,null,null,null,null,null,null,null,null,null,0]
[null,null,null,null,null,null,null,null,null,null,null,null,null,null,null,null,null,null,null,null,null,null,null,null,null,null,null,null,null,null,null,null,null,null,null,{"$f":"SUM(AJ29:AJ38,AJ22)","v":0}]
[null,"【都市計画区域内外の別】"]
[null,null,null,null,null,null,null,null,"□","都市計画区域内"]
[null,null,null,null,null,null,null,null,"□","都市計画区域外  "]
[]
[null,"【地区計画等区域】",null,null,null,null,null,null,null,null,null,null,null,null,null,null,null,null,null,{"$f":"VLOOKUP($AJ$21,DATA!$A$4:$AV$347,20,FALSE)","v":{"$error":"#N/A"}},null,null,"地区計画等とは"]
[null,null,"【調査日】",null,null,null,null,null,null,null,null,null,null,null,null,null,null,null,null,null,null,null,"・","地区計画"]
[null,null,"【行政庁担当課名】",null,null,null,null,null,null,null,null,null,null,null,null,null,null,null,null,null,null,null,"・","沿道地区計画"]
[null,null,null,null,null,null,null,null,"□","該当地区なし",null,null,null,null,null,null,null,null,null,null,null,null,"・","防災街区整備地区計画"]
[null,null,null,null,null,null,null,null,"□","該当地区あり",null,null,null,null,null,null,null,null,null,null,null,null,"の３つの地区の事をいいます。"]
[null,null,null,null,null,null,null,null,null,"□","区域外"]
[null,null,null,null,null,null,null,null,null,"□","区域内"]
[null,null,null,null,null,null,null,null,null,"【地区計画の名称】"]
[null,null,null,null,null,null,null,null,null,null,null,null,"□","適合証又は適合することを確認できる図書有"]
[null,null,null,null,null,null,null,null,null,null,null,null,"□","適合証又は適合することを確認できる図書無し"]
[]
[null,"【建築協定区域】",null,null,null,null,null,null,null,null,null,null,null,null,null,null,null,null,null,{"$f":"VLOOKUP($AJ$21,DATA!$A$4:$AV$347,21,FALSE)","v":{"$error":"#N/A"}}]
[null,null,"【調査日】",null,null,null,null,null,null,null,null,null,null,null,null,{"$f":"IF(I45=\"\",\"\",\"←\"&TEXT(I45,\"ggge年mm月dd日\")&\"と異なる場合は入力\")","v":""}]
[null,null,"【行政庁担当課名】"]
[null,null,null,null,null,null,null,null,"□","該当区域なし"]
[null,null,null,null,null,null,null,null,"□","該当区域あり"]
[null,null,null,null,null,null,null,null,null,"□","区域外"]
{"$rows_left_out":143}
{"sheet":"DATA","index":1,"n_rows":347,"n_cols":48,"rows_kept":347,"cut":false,"hidden":true,"merged":[[1,47,2,47],[1,31,1,35],[0,9,1,9],[1,40,1,43],[0,10,1,11],[1,19,1,23],[0,31,0,46],[0,7,1,7],[0,8,1,8],[0,12,0,13],[0,14,0,30],[1,14,1,18],[1,30,2,30],[0,6,1,6],[0,0,2,0],[0,1,2,1],[0,2,2,2],[0,3,2,3],[0,5,2,5],[0,4,2,4]]}
["№","県\nコード","都道府県名","市町村\nコード","群\n(新旧含む)","市町村名","地域の区分","年間\n日射量地域区分","暖房期\n日射量地域区分","基準風速","積雪",null,"所管行政庁\n（未記入は県）",null,"長期優良住宅",null,null,null,null,null,null,null,null,null,null,null,null,null,null,null,null,"低炭素建築物",null,null,null,null,null,null,null,null,null,null,null,null,null,null,null,"地域別追加料金"]
[null,null,null,null,null,null,null,null,null,null,null,null,"１～３号","４号","審査項目",null,null,null,null,"居住環境配慮基準",null,null,null,null,"都計法\n第４条第４項","都計法\n第４条第６項","都計法\n第４条第７項","都計法\n第４条第８項","住宅地区改良法\n第２条第３項",null,"技術的審査料金\n区分","審査項目",null,null,null,null,"区域制限","都計法\n第12条","都計法\n第34条","都計法\n第45条","都市の緑地保全への配慮",null,null,null,null,null,null,"数字:都市計画区域の判断あり"]
[null,null,null,null,null,null,"[地域]","[区分]","[区分]","[m/s]","[cm]","多雪地域","特定\n行政庁","限定特定\n行政庁","長期使用構造等","住宅規模","居住環境配慮基準","維持保全計画","資金計画","地区計画等","景観計画","建築協定","景観協定","景観法\nに基づ\nかない\n景観に\n関する 条 例 ","促進区域","都市計画施設の区域","市街地再開発事業の区域","市街地開発事業等予定区域","改良地区",null,null,"外皮性能","一次エネルギー消費量","その他の措置","基本的な方針","資金計画","用途地域","特別緑地保全地区制度","緑化地域制度","緑化協定制度","生産緑地地区","建築協定","緑地保全に関する市町村条例","都市施設緑地"]
[1,21,"岐阜県",21,null,"岐阜県",null,null,null,null,null,null,"岐阜県","岐阜県","■","■","■","■","■",null,null,null,null,null,null,null,null,null,null,null,"イ","■","■","■","■","■"]
[2,21,"岐阜県",201,null,"岐阜市（旧岐阜市)",6,"A4","H4",34,40,null,"岐阜市","岐阜市","■","■","■","■","■","○","○",null,null,null,null,null,null,null,null,null,"イ","■","■","■","■","■"]
[19,21,"岐阜県",201,"羽島郡","岐阜市（旧柳津町)",6,"A4","H4",34,30,null,"岐阜市","岐阜市","■","■","■","■","■","○","○",null,null,null,null,null,null,null,null,null,"イ","■","■","■","■","■"]
[3,21,"岐阜県",202,null,"大垣市（旧大垣市)",6,"A4","H4",34,45,null,"大垣市","大垣市","■","■","■","■","■","○","○",null,null,null,null,null,null,null,null,null,"イ","■","■","■","■","■",null,null,null,null,null,null,null,null,null,null,null,1]
[24,21,"岐阜県",202,"養老郡","大垣市（旧上石津町)",5,"A4","H1",34,100,null,"大垣市","大垣市","■","■","■","■","■","○","○",null,null,null,null,null,null,null,null,null,"イ","■","■","■","■","■",null,null,null,null,null,null,null,null,null,null,null,1]
[30,21,"岐阜県",202,"安八郡","大垣市（旧墨俣町)",6,"A4","H4",34,40,null,"大垣市","大垣市","■","■","■","■","■","○","○",null,null,null,null,null,null,null,null,null,"イ","■","■","■","■","■",null,null,null,null,null,null,null,null,null,null,null,1]
[4,21,"岐阜県",203,null,"高山市（旧高山市)",3,"A3","H4",null,120,"○",null,"高山市","■","■","■","■","■","○","○",null,null,null,null,null,null,null,null,null,"イ","■","■","■","■","■",null,null,null,null,null,null,null,null,null,null,null,"C"]
[87,21,"岐阜県",203,"大野郡","高山市（旧丹生川村)",3,"A3","H4",null,150,"○",null,"高山市","■","■","■","■","■","○","○",null,null,null,null,null,null,null,null,null,"イ","■","■","■","■","■",null,null,null,null,null,null,null,null,null,null,null,"C"]
[88,21,"岐阜県",203,"大野郡","高山市（旧清見村)",3,"A3","H4",null,190,"○",null,"高山市","■","■","■","■","■","○","○",null,null,null,null,null,null,null,null,null,"イ","■","■","■","■","■",null,null,null,null,null,null,null,null,null,null,null,"C"]
[89,21,"岐阜県",203,"大野郡","高山市（旧荘川村)",3,"A3","H4",null,260,"○",null,"高山市","■","■","■","■","■","○","○",null,null,null,null,null,null,null,null,null,"イ","■","■","■","■","■",null,null,null,null,null,null,null,null,null,null,null,"C"]
[91,21,"岐阜県",203,"大野郡","高山市（旧宮村)",3,"A3","H4",null,120,"○",null,"高山市","■","■","■","■","■","○","○",null,null,null,null,null,null,null,null,null,"イ","■","■","■","■","■",null,null,null,null,null,null,null,null,null,null,null,"C"]
[92,21,"岐阜県",203,"大野郡","高山市（旧久々野町)",3,"A3","H4",null,120,"○",null,"高山市","■","■","■","■","■","○","○",null,null,null,null,null,null,null,null,null,"イ","■","■","■","■","■",null,null,null,null,null,null,null,null,null,null,null,"C"]
[93,21,"岐阜県",203,"大野郡","高山市（旧朝日村)",3,"A3","H4",null,120,"○",null,"高山市","■","■","■","■","■","○","○",null,null,null,null,null,null,null,null,null,"イ","■","■","■","■","■",null,null,null,null,null,null,null,null,null,null,null,"C"]
[94,21,"岐阜県",203,"大野郡","高山市（旧高根村)",3,"A3","H4",null,170,"○",null,"高山市","■","■","■","■","■","○","○",null,null,null,null,null,null,null,null,null,"イ","■","■","■","■","■",null,null,null,null,null,null,null,null,null,null,null,"C"]
[96,21,"岐阜県",203,"吉城郡","高山市（旧国府町)",3,"A3","H4",null,140,"○",null,"高山市","■","■","■","■","■","○","○",null,null,null,null,null,null,null,null,null,"イ","■","■","■","■","■",null,null,null,null,null,null,null,null,null,null,null,"C"]
[100,21,"岐阜県",203,"吉城郡","高山市（旧上宝村)",3,"A3","H4",null,250,"○",null,"高山市","■","■","■","■","■","○","○",null,null,null,null,null,null,null,null,null,"イ","■","■","■","■","■",null,null,null,null,null,null,null,null,null,null,null,"C"]
[5,21,"岐阜県",204,null,"多治見市（旧多治見市)",5,"A4","H2",32,30,null,null,"多治見市","■","■","■","■","■","○","○","△",null,null,null,null,null,null,null,null,"イ","■","■","■","■","■"]
[70,21,"岐阜県",204,"土岐郡","多治見市（旧笠原町)",5,"A4","H2",null,30,null,null,"多治見市","■","■","■","■","■","○","○","△",null,null,null,null,null,null,null,null,"イ","■","■","■","■","■"]
[6,21,"岐阜県",205,null,"関市（旧関市)",5,"A4","H2",32,40,null,null,null,"■","■","■","■","■","○","○",null,null,null,null,null,null,null,null,null,"イ","■","■","■","■","■",null,null,null,null,null,null,null,null,null,null,null,2]
[49,21,"岐阜県",205,"武儀郡","関市（旧洞戸村)",5,"A3","H2",32,100,"○",null,null,"■","■","■","■","■","○","○",null,null,null,null,null,null,null,null,null,"イ","■","■","■","■","■",null,null,null,null,null,null,null,null,null,null,null,2]
[50,21,"岐阜県",205,"武儀郡","関市（旧板取村)",5,"A3","H2",null,170,"○",null,null,"■","■","■","■","■","○","○",null,null,null,null,null,null,null,null,null,"イ","■","■","■","■","■",null,null,null,null,null,null,null,null,null,null,null,2]
[51,21,"岐阜県",205,"武儀郡","関市（旧武芸川町)",5,"A3","H2",32,60,null,null,null,"■","■","■","■","■","○","○",null,null,null,null,null,null,null,null,null,"イ","■","■","■","■","■",null,null,null,null,null,null,null,null,null,null,null,2]
[52,21,"岐阜県",205,"武儀郡","関市（旧武儀町)",5,"A4","H2",null,40,null,null,null,"■","■","■","■","■","○","○",null,null,null,null,null,null,null,null,null,"イ","■","■","■","■","■",null,null,null,null,null,null,null,null,null,null,null,2]
[53,21,"岐阜県",205,"武儀郡","関市（旧上之保村)",5,"A3","H3",null,80,null,null,null,"■","■","■","■","■","○","○",null,null,null,null,null,null,null,null,null,"イ","■","■","■","■","■",null,null,null,null,null,null,null,null,null,null,null,2]
[7,21,"岐阜県",206,null,"中津川市（旧中津川市)",5,"A3","H3",null,30,null,null,null,"■","■","■","■","■","○","○",null,null,null,null,null,null,null,null,null,"イ","■","■","■","■","■",null,null,null,null,null,null,null,null,null,null,null,"B"]
[71,21,"岐阜県",206,"恵那郡","中津川市（旧坂下町)",4,"A3","H2",null,50,null,null,null,"■","■","■","■","■","○","○",null,null,null,null,null,null,null,null,null,"イ","■","■","■","■","■",null,null,null,null,null,null,null,null,null,null,null,"B"]
[72,21,"岐阜県",206,"恵那郡","中津川市（旧川上村)",4,"A3","H2",null,60,null,null,null,"■","■","■","■","■","○","○",null,null,null,null,null,null,null,null,null,"イ","■","■","■","■","■",null,null,null,null,null,null,null,null,null,null,null,"B"]
[73,21,"岐阜県",206,"恵那郡","中津川市（旧加子母村)",4,"A3","H3",null,70,null,null,null,"■","■","■","■","■","○","○",null,null,null,null,null,null,null,null,null,"イ","■","■","■","■","■",null,null,null,null,null,null,null,null,null,null,null,"B"]
[74,21,"岐阜県",206,"恵那郡","中津川市（旧付知町)",4,"A3","H2",null,60,null,null,null,"■","■","■","■","■","○","○",null,null,null,null,null,null,null,null,null,"イ","■","■","■","■","■",null,null,null,null,null,null,null,null,null,null,null,"B"]
[75,21,"岐阜県",206,"恵那郡","中津川市（旧福岡町)",4,"A3","H2",null,50,null,null,null,"■","■","■","■","■","○","○",null,null,null,null,null,null,null,null,null,"イ","■","■","■","■","■",null,null,null,null,null,null,null,null,null,null,null,"B"]
[76,21,"岐阜県",206,"恵那郡","中津川市（旧蛭川村)",4,"A4","H2",null,40,null,null,null,"■","■","■","■","■","○","○",null,null,null,null,null,null,null,null,null,"イ","■","■","■","■","■",null,null,null,null,null,null,null,null,null,null,null,"B"]
[101,21,"岐阜県",206,null,"中津川市（旧長野県山口村)",5,"A3","H3",null,70,null,null,null,"■","■","■","■","■","○","○",null,null,null,null,null,null,null,null,null,"イ","■","■","■","■","■",null,null,null,null,null,null,null,null,null,null,null,"B"]
[8,21,"岐阜県",207,null,"美濃市",5,"A3","H2",32,60,null,null,null,"■","■","■","■","■","○","○",null,null,null,null,null,null,null,null,null,"イ","■","■","■","■","■"]
[9,21,"岐阜県",208,null,"瑞浪市",5,"A4","H3",null,30,null,null,null,"■","■","■","■","■","○","○",null,null,null,null,null,null,null,null,null,"イ","■","■","■","■","■",null,null,null,null,null,null,null,null,null,null,null,"A"]
[10,21,"岐阜県",209,null,"羽島市",6,"A4","H4",34,30,null,null,null,"■","■","■","■","■","○","○",null,null,null,null,null,null,null,null,null,"イ","■","■","■","■","■"]
[11,21,"岐阜県",210,null,"恵那市（旧恵那市)",5,"A4","H3",null,30,null,null,null,"■","■","■","■","■","○","○",null,null,null,null,null,null,null,null,null,"イ","■","■","■","■","■",null,null,null,null,null,null,null,null,null,null,null,"B"]
[77,21,"岐阜県",210,"恵那郡","恵那市（旧岩村町)",5,"A3","H3",null,30,null,null,null,"■","■","■","■","■","○","○",null,null,null,null,null,null,null,null,null,"イ","■","■","■","■","■",null,null,null,null,null,null,null,null,null,null,null,"B"]
[78,21,"岐阜県",210,"恵那郡","恵那市（旧山岡町)",5,"A4","H3",null,30,null,null,null,"■","■","■","■","■","○","○",null,null,null,null,null,null,null,null,null,"イ","■","■","■","■","■",null,null,null,null,null,null,null,null,null,null,null,"B"]
[79,21,"岐阜県",210,"恵那郡","恵那市（旧明智町)",5,"A3","H3",null,30,null,null,null,"■","■","■","■","■","○","○",null,null,null,null,null,null,null,null,null,"イ","■","■","■","■","■",null,null,null,null,null,null,null,null,null,null,null,"B"]
[80,21,"岐阜県",210,"恵那郡","恵那市（旧串原村)",4,"A3","H2",null,30,null,null,null,"■","■","■","■","■","○","○",null,null,null,null,null,null,null,null,null,"イ","■","■","■","■","■",null,null,null,null,null,null,null,null,null,null,null,"B"]
[81,21,"岐阜県",210,"恵那郡","恵那市（旧上矢作町)",4,"A3","H2",null,30,null,null,null,"■","■","■","■","■","○","○",null,null,null,null,null,null,null,null,null,"イ","■","■","■","■","■",null,null,null,null,null,null,null,null,null,null,null,"B"]
[12,21,"岐阜県",211,null,"美濃加茂市",5,"A4","H2",32,30,null,null,null,"■","■","■","■","■","○","○",null,null,null,null,null,null,null,null,null,"イ","■","■","■","■","■"]
[13,21,"岐阜県",212,null,"土岐市",5,"A4","H3",null,30,null,null,null,"■","■","■","■","■","○","○",null,null,null,null,null,null,null,null,null,"イ","■","■","■","■","■"]
[14,21,"岐阜県",213,null,"各務原市（旧各務原市)",6,"A4","H4",32,30,null,"各務原市","各務原市","■","■","■","■","■","○","○",null,null,null,null,null,null,null,null,null,"イ","■","■","■","■","■"]
[16,21,"岐阜県",213,"羽島郡","各務原市（旧川島町)",6,"A4","H4",34,30,null,"各務原市","各務原市","■","■","■","■","■","○","○",null,null,null,null,null,null,null,null,null,"イ","■","■","■","■","■"]
[15,21,"岐阜県",214,null,"可児市（旧可児市)",5,"A4","H2",32,30,null,null,"可児市","■","■","■","■","■","○","○",null,null,null,null,null,null,null,null,null,"イ","■","■","■","■","■"]
[69,21,"岐阜県",214,"可児郡","可児市（旧兼山町)",5,"A4","H2",null,30,null,null,"可児市","■","■","■","■","■","○","○",null,null,null,null,null,null,null,null,null,"イ","■","■","■","■","■"]
[46,21,"岐阜県",215,"山県郡","山県市（旧高富町)",5,"A3","H1",32,40,null,null,null,"■","■","■","■","■","○","○",null,null,null,null,null,null,null,null,null,"イ","■","■","■","■","■",null,null,null,null,null,null,null,null,null,null,null,2]
[47,21,"岐阜県",215,"山県郡","山県市（旧伊自良村)",5,"A3","H1",32,80,null,null,null,"■","■","■","■","■","○","○",null,null,null,null,null,null,null,null,null,"イ","■","■","■","■","■",null,null,null,null,null,null,null,null,null,null,null,2]
[48,21,"岐阜県",215,"山県郡","山県市（旧美山町)",5,"A3","H2",32,100,"○",null,null,"■","■","■","■","■","○","○",null,null,null,null,null,null,null,null,null,"イ","■","■","■","■","■",null,null,null,null,null,null,null,null,null,null,null,2]
[41,21,"岐阜県",216,"本巣郡","瑞穂市（旧穂積町)",6,"A4","H4",34,40,null,null,null,"■","■","■","■","■","○","○",null,null,null,null,null,null,null,null,null,"イ","■","■","■","■","■"]
[42,21,"岐阜県",216,"本巣郡","瑞穂市（旧巣南町)",6,"A4","H4",34,50,null,null,null,"■","■","■","■","■","○","○",null,null,null,null,null,null,null,null,null,"イ","■","■","■","■","■"]
[95,21,"岐阜県",217,"吉城郡","飛騨市（旧古川町)",3,"A3","H3",null,200,"○",null,null,"■","■","■","■","■","○","○",null,null,null,null,null,null,null,null,null,"イ","■","■","■","■","■",null,null,null,null,null,null,null,null,null,null,null,"C"]
[97,21,"岐阜県",217,"吉城郡","飛騨市（旧河合村)",3,"A3","H3",null,270,"○",null,null,"■","■","■","■","■","○","○",null,null,null,null,null,null,null,null,null,"イ","■","■","■","■","■",null,null,null,null,null,null,null,null,null,null,null,"C"]
[98,21,"岐阜県",217,"吉城郡","飛騨市（旧宮川村)",4,"A2","H1",null,280,"○",null,null,"■","■","■","■","■","○","○",null,null,null,null,null,null,null,null,null,"イ","■","■","■","■","■",null,null,null,null,null,null,null,null,null,null,null,"C"]
[99,21,"岐阜県",217,"吉城郡","飛騨市（旧神岡町)",4,"A3","H2",null,200,"○",null,null,"■","■","■","■","■","○","○",null,null,null,null,null,null,null,null,null,"イ","■","■","■","■","■",null,null,null,null,null,null,null,null,null,null,null,"C"]
[40,21,"岐阜県",218,"本巣郡","本巣市（旧本巣町)",6,"A3","H5",34,80,null,null,null,"■","■","■","■","■","○","○",null,null,null,null,null,null,null,null,null,"イ","■","■","■","■","■",null,null,null,null,null,null,null,null,null,null,null,2]
{"$rows_left_out":288}
{"sheet":"項目リスト","index":2,"n_rows":49,"n_cols":4,"rows_kept":49,"cut":false,"hidden":true,"merged":[]}
["申請書"]
["資格","一級","二級","木造"]
["一級","大臣","愛知県知事","愛知県知事"]
["二級",null,"岐阜県知事","岐阜県知事"]
["木造",null,"三重県知事","三重県知事"]
[null,null,"静岡県知事","静岡県知事"]
[null,null,"愛媛県知事","愛媛県知事"]
[null,null,"茨城県知事","茨城県知事"]
[null,null,"岡山県知事","岡山県知事"]
[null,null,"沖縄県知事","沖縄県知事"]
[null,null,"岩手県知事","岩手県知事"]
[null,null,"宮崎県知事","宮崎県知事"]
[null,null,"宮城県知事","宮城県知事"]
[null,null,"京都府知事","京都府知事"]
[null,null,"熊本県知事","熊本県知事"]
[null,null,"群馬県知事","群馬県知事"]
[null,null,"広島県知事","広島県知事"]
[null,null,"香川県知事","香川県知事"]
[null,null,"高知県知事","高知県知事"]
[null,null,"佐賀県知事","佐賀県知事"]
[null,null,"埼玉県知事","埼玉県知事"]
[null,null,"山形県知事","山形県知事"]
[null,null,"山口県知事","山口県知事"]
[null,null,"山梨県知事","山梨県知事"]
[null,null,"滋賀県知事","滋賀県知事"]
[null,null,"鹿児島県知事","鹿児島県知事"]
[null,null,"秋田県知事","秋田県知事"]
[null,null,"新潟県知事","新潟県知事"]
[null,null,"神奈川県知事","神奈川県知事"]
[null,null,"青森県知事","青森県知事"]
[null,null,"石川県知事","石川県知事"]
[null,null,"千葉県知事","千葉県知事"]
[null,null,"大阪府知事","大阪府知事"]
[null,null,"大分県知事","大分県知事"]
[null,null,"長崎県知事","長崎県知事"]
[null,null,"長野県知事","長野県知事"]
[null,null,"鳥取県知事","鳥取県知事"]
[null,null,"島根県知事","島根県知事"]
[null,null,"東京都知事","東京都知事"]
[null,null,"徳島県知事","徳島県知事"]
[null,null,"栃木県知事","栃木県知事"]
[null,null,"奈良県知事","奈良県知事"]
[null,null,"富山県知事","富山県知事"]
[null,null,"福井県知事","福井県知事"]
[null,null,"福岡県知事","福岡県知事"]
[null,null,"福島県知事","福島県知事"]
[null,null,"兵庫県知事","兵庫県知事"]
[null,null,"北海道知事","北海道知事"]
[null,null,"和歌山県知事","和歌山県知事"]