{"text_format":"1","workbook":"xlsx","n_sheets":7,"sheets":["シート構成","入力シート","★申請書","☆複数申請者","I","DATA","項目リスト"],"not_rendered":{"charts":0,"images":0,"macros":1,"external_links":0,"defined_names":33,"comments":0,"pivot_tables":0},"unopened":[],"bounds":{"document_bytes":16777216,"sheet_cells":100000,"rows_first":2000,"rows_last":500,"rows_between":2000,"halvings":0,"cell_chars":16384,"cell_head_chars":4096},"cells_cut":0,"cells_raw":0,"read":"whole","date_system":"1900"}

{"sheet":"シート構成","index":0,"n_rows":46,"n_cols":26,"rows_kept":46,"cut":false,"hidden":false,"merged":[[7,2,7,11],[20,12,20,17],[21,12,21,17],[20,18,20,45],[21,18,21,45],[19,12,19,24],[19,25,19,32]]}
["申請書作成シートについて",null,null,null,null,null,null,null,null,null,null,null,null,"2021/05/10 Ver.3.5"]
[]
["【現金取得者向け新築対象住宅証明書審査申請書（すまい給付金）の作成】"]
[null,"◆入力"]
[null,null,"入力シートに入力した内容が印刷用シートに反映されます。"]
[null,null,"当センターの「確認申請作成シート」で、確認申請書を作成されている場合は、その入力データを取り込んで、一部の入力を省略することが出来ます。"]
[]
[null,null,"「入力シート」へ"]
[]
[null,null,"［入力について］"]
[null,null,"網掛けしたセル部分が申請書に記載される部分です。網掛けの色に応じて入力してください。"]
[null,null,null,null,null,"この色のセルには直接入力またはチェックボックスにチェックを入れてください。"]
[null,null,null,null,null,"この色のセルはリストから該当する内容を選択してください。"]
[null,null,null,null,null,"この色のセルはリストから該当する内容を選択、または直接入力してください。"]
[null,null,null,null,null,"この色のセルは入力しないでください。"]
[null,null,null,null,null,"網掛け無し（枠線のみ）のセルは自動計算部分または定型部分となりますので入力できません。"]
[null,null,null,null,null,"網掛けのセルは確認申請ファイルからデータを取り込んているので、入力不要です。確認申請ファイルから内容を変更したい場合は、そのまま入力してください。"]
[]
[]
[null,null,null,null,null,null,null,null,null,null,null,null,"取り込み可能 確認申請ファイルのバージョン",null,null,null,null,null,null,null,null,null,null,null,null,"2021/01/01 Ver.13.0"]
{"$rows_left_out":27}
{"sheet":"入力シート","index":1,"n_rows":114,"n_cols":36,"rows_kept":114,"cut":false,"hidden":false,"merged":[[70,7,70,26],[104,18,104,20],[105,18,105,20],[106,18,106,20],[23,10,23,12],[71,9,71,11],[80,23,80,26],[79,8,79,18],[49,9,49,10],[72,7,72,19],[64,8,64,14],[50,8,50,26],[78,9,78,10],[78,15,78,18],[51,8,51,11],[52,8,52,26],[0,0,0,24],[13,12,13,13],[37,8,37,26],[39,8,39,26],[42,8,42,26],[38,8,38,26],[2,9,2,12],[0,26,0,32],[11,12,11,13],[14,12,14,13],[15,12,15,13],[7,8,7,11],[8,8,8,23],[27,8,27,26],[11,21,11,22],[14,21,14,22],[80,16,80,18],[80,9,80,10],[47,9,47,10],[85,8,85,14],[33,8,33,26],[34,8,34,26],[53,8,53,14],[78,22,78,25],[67,1,67,26],[43,8,43,26],[44,8,44,26],[56,8,56,26],[54,8,54,14],[49,16,49,18],[49,23,49,26],[47,22,47,25],[59,1,62,26],[2,1,2,4],[2,5,2,8],[47,15,47,18],[7,1,7,6],[8,1,8,6],[26,8,26,26],[28,8,28,26],[12,12,12,13],[48,8,48,18],[15,21,15,22],[12,21,12,22],[13,21,13,22],[32,8,32,26],[113,14,113,23],[110,14,110,24],[112,14,112,20],[111,14,111,20],[96,15,96,16],[96,8,96,14],[96,17,96,23],[98,8,98,24],[99,11,99,16],[99,17,99,19],[101,8,101,18],[99,9,99,10],[81,8,81,26],[82,8,82,11],[83,8,83,26],[94,5,94,7],[89,8,89,11],[91,16,91,19],[94,12,94,14],[94,8,94,10],[94,15,94,17],[92,16,92,19],[87,8,87,11],[84,8,84,14]]}
["入力シート（現金取得者向け新築対象住宅証明書審査申請書（すまい給付金））",null,null,null,null,null,null,null,null,null,null,null,null,null,null,null,null,null,null,null,null,null,null,null,null,null,"シートの構成に戻る"]
[]
[null,"地域情報",null,null,null,"第一面",null,null,null,"第二面"]
[]
["◆","地域情報"]
[]
["【地域情報】"]
[null,"【都道府県名】",null,null,null,null,null,null,null,null,null,null,null,null,null,null,null,null,null,null,null,null,null,null,null,null,null,null,null,null,null,null,null,null,null,{"$f":"SUMIF(DATA!F4:F347,I8,DATA!A4:A347)","v":0}]
[null,"【市町村名】",null,null,null,null,null,null,null,null,null,null,null,null,null,null,null,null,null,null,null,null,null,null,null,null,null,null,null,null,null,null,null,null,null,{"$f":"SUMIF(DATA!F4:F347,I9,DATA!A4:A347)","v":0}]
[]
[null,null,null,null,null,null,null,null,null,null,null,null,null,null,null,null,null,null,null,null,null,"参考値"]
[null,"【断熱地域区分】",null,null,null,null,null,null,null,null,"※１",null,null,null,"地域",null,null,null,null,null,null,{"$f":"VLOOKUP($AJ$9,DATA!$A$4:$AV$347,7,FALSE)","v":{"$error":"#N/A"}},null,"地域",null,null,null,null,null,null,null,null,null,null,null,{"$f":"IF(M12=V12,0,1)","v":{"$error":"#N/A"}}]
[null,"【年間日射量地域区分】",null,null,null,null,null,null,null,null,"※１",null,null,null,"区分",null,null,null,null,null,null,{"$f":"VLOOKUP($AJ$9,DATA!$A$4:$AV$347,8,FALSE)","v":{"$error":"#N/A"}},null,"区分",null,null,null,null,null,null,null,null,null,null,null,{"$f":"IF(M13=V13,0,1)","v":{"$error":"#N/A"}}]
[null,"【暖房期日射量地域区分】",null,null,null,null,null,null,null,null,"※１",null,null,null,"区分",null,null,null,null,null,null,{"$f":"VLOOKUP($AJ$9,DATA!$A$4:$AV$347,9,FALSE)","v":{"$error":"#N/A"}},null,"区分",null,null,null,null,null,null,null,null,null,null,null,{"$f":"IF(M14=V14,0,1)","v":{"$error":"#N/A"}}]
[null,"【基準風速】",null,null,null,null,null,null,null,null,"※２",null,null,null,"m/s",null,null,null,null,null,null,{"$f":"IF(VLOOKUP($AJ$9,DATA!$A$4:$AV$347,10,FALSE)=\"\",30,VLOOKUP($AJ$9,DATA!$A$4:$AV$347,10,FALSE))","v":{"$error":"#N/A"}},null,"m/s",null,null,null,null,null,null,null,null,null,null,null,{"$f":"IF(M15=V15,0,1)","v":{"$error":"#N/A"}}]
[null,"【垂直積雪量】",null,null,null,null,null,null,null,null,"※２",null,null,null,"cm",null,null,null,null,null,null,{"$f":"VLOOKUP($AJ$9,DATA!$A$4:$AV$347,11,FALSE)","v":{"$error":"#N/A"}},null,"cm",null,null,{"$f":"IF(VLOOKUP($AJ$9,DATA!$A$4:$AV$347,12,FALSE)=\"○\",\"多雪地域\",\"\")","v":{"$error":"#N/A"}},null,null,null,null,null,null,null,null,{"$f":"IF(M16=V16,0,1)","v":{"$error":"#N/A"}}]
[]
[null,null,null,"※１　「断熱等性能等級」 と 「一次エネルギー消費量等級」 の場合に入力"]
[null,null,null,"※２　「耐震等級」 の場合に入力"]
[]
{"$rows_left_out":95}
{"sheet":"★申請書","index":2,"n_rows":121,"n_cols":38,"rows_kept":121,"cut":false,"hidden":false,"merged":[[117,9,117,31],[88,17,89,21],[115,6,115,7],[116,6,116,7],[115,9,115,16],[94,9,95,15],[94,18,95,24],[94,1,95,7],[116,9,116,16],[114,9,114,31],[114,5,114,7],[110,10,110,31],[64,26,64,30],[64,10,64,11],[66,27,66,31],[65,9,65,21],[92,11,93,13],[92,18,93,20],[84,9,85,13],[67,9,67,32],[74,2,74,7],[61,15,61,18],[32,2,39,8],[24,1,24,5],[42,9,42,32],[43,9,43,10],[43,12,43,13],[43,15,43,16],[68,9,68,12],[69,9,69,31],[70,9,70,16],[71,9,71,16],[64,17,64,21],[66,10,66,11],[66,18,66,21],[57,30,58,32],[57,1,58,3],[57,4,58,6],[57,7,58,11],[24,6,27,33],[44,9,44,32],[57,27,58,29],[75,2,75,7],[96,1,97,32],[88,1,89,7],[90,17,91,21],[88,9,89,16],[90,9,91,15],[84,1,85,7],[86,9,87,13],[94,16,95,17],[92,1,93,7],[86,1,87,7],[1,7,1,26],[7,17,8,33],[10,17,10,31],[9,17,9,33],[12,17,13,33],[0,30,1,31],[0,32,1,33],[3,25,3,26],[3,28,3,29],[3,31,3,32],[7,8,7,16],[8,8,8,16],[9,8,9,16],[12,8,12,16],[13,8,13,16],[14,8,14,16],[41,1,41,21],[15,17,15,31],[16,1,19,32],[14,17,14,33],[20,16,21,17],[22,6,22,28]]}
[null,null,null,null,null,null,null,null,null,null,null,null,null,null,null,null,null,null,null,null,null,null,null,null,null,null,null,null,null,null,"正",null,"副",null,null,1]
[null,null,null,null,null,null,null,"現金取得者向け新築対象住宅証明書審査申請書",null,null,null,null,null,null,null,null,null,null,null,null,null,null,null,null,null,null,null,null,null,null,null,null,null,null,null,1]
[null,null,null,null,null,null,null,null,null,null,null,null,null,null,null,null,null,null,null,null,null,null,null,null,null,null,null,null,null,null,null,null,null,null,null,1]
[null,null,null,null,null,null,null,null,null,null,null,null,null,null,null,null,null,null,null,null,null,null,null,null,null,{"$f":"入力シート!K24","v":0},null,"年",{"$f":"入力シート!O24","v":0},null,"月",{"$f":"入力シート!Q24","v":0},null,"日",null,1]
[null,null,null,null,null,null,null,null,null,null,null,null,null,null,null,null,null,null,null,null,null,null,null,null,null,null,null,null,null,null,null,null,null,null,null,1]
[null,"一般財団法人 愛知県建築住宅センター 理事長　様",null,null,null,null,null,null,null,null,null,null,null,null,null,null,null,null,null,null,null,null,null,null,null,null,null,null,null,null,null,null,null,null,null,1]
[null,null,null,null,null,null,null,null,null,null,null,null,null,null,null,null,null,null,null,null,null,null,null,null,null,null,null,null,null,null,null,null,null,null,null,1]
[null,null,null,null,null,null,null,null,"証明申請者の住所又は",null,null,null,null,null,null,null,null,{"$f":"IF(AL8=0,\"\",AL8)","v":""},null,null,null,null,null,null,null,null,null,null,null,null,null,null,null,null,null,1,null,{"$f":"IF(入力シート!I29=\"\",入力シート!AC29,入力シート!I29)","v":0}]
[null,null,null,null,null,null,null,null,"主たる事務所の所在地",null,null,null,null,null,null,null,null,null,null,null,null,null,null,null,null,null,null,null,null,null,null,null,null,null,null,1]
[null,null,null,null,null,null,null,null,"証明申請者の氏名又は名称",null,null,null,null,null,null,null,null,{"$f":"IF(AL10=0,\"\",AL10)","v":""},null,null,null,null,null,null,null,null,null,null,null,null,null,null,null,null,null,1,null,{"$f":"IF(入力シート!I27=\"\",入力シート!AC27,入力シート!I27)","v":0}]
[null,null,null,null,null,null,null,null,null,null,null,null,null,null,null,null,null,{"$f":"IF(AL11=0,\"\",AL11)","v":""},null,null,null,null,null,null,null,null,null,null,null,null,null,null,null,null,null,1,null,{"$f":"IF(入力シート!I28=\"\",入力シート!AC28,入力シート!I28)","v":0}]
[null,null,null,null,null,null,null,null,null,null,null,null,null,null,null,null,null,null,null,null,null,null,null,null,null,null,null,null,null,null,null,null,null,null,null,1]
[null,null,null,null,null,null,null,null,"代理人の住所又は",null,null,null,null,null,null,null,null,{"$f":"IF(AL13=0,\"\",AL13)","v":""},null,null,null,null,null,null,null,null,null,null,null,null,null,null,null,null,null,1,null,{"$f":"IF(入力シート!I53=\"\",I!I35,入力シート!I53)","v":0}]
[null,null,null,null,null,null,null,null,"主たる事務所の所在地",null,null,null,null,null,null,null,null,null,null,null,null,null,null,null,null,null,null,null,null,null,null,null,null,null,null,1]
[null,null,null,null,null,null,null,null,"代理人の氏名又は名称",null,null,null,null,null,null,null,null,{"$f":"IF(AL15=0,\"\",AL15)","v":""},null,null,null,null,null,null,null,null,null,null,null,null,null,null,null,null,null,1,null,{"$f":"IF(入力シート!I51=\"\",I!I33,入力シート!I51)","v":0}]
[null,null,null,null,null,null,null,null,null,null,null,null,null,null,null,null,null,{"$f":"IF(AL16=0,\"\",AL16)","v":""},null,null,null,null,null,null,null,null,null,null,null,null,null,null,null,null,null,1,null,{"$f":"IF(入力シート!I49=\"\",I!I31,入力シート!I49)","v":0}]
[null,"　現金取得者向け新築対象住宅証明書発行のための適合審査を申請します。\n　この申請書及び提出図書に記載の事項は、事実に相違ありません。\n　なお、依頼者は現金取得者向け新築対象住宅証明書発行の手続きに関する一切の権限を代理人に委任します。",null,null,null,null,null,null,null,null,null,null,null,null,null,null,null,null,null,null,null,null,null,null,null,null,null,null,null,null,null,null,null,null,null,1]
[null,null,null,null,null,null,null,null,null,null,null,null,null,null,null,null,null,null,null,null,null,null,null,null,null,null,null,null,null,null,null,null,null,null,null,1]
[null,null,null,null,null,null,null,null,null,null,null,null,null,null,null,null,null,null,null,null,null,null,null,null,null,null,null,null,null,null,null,null,null,null,null,1]
[null,null,null,null,null,null,null,null,null,null,null,null,null,null,null,null,null,null,null,null,null,null,null,null,null,null,null,null,null,null,null,null,null,null,null,1]
{"$rows_left_out":102}
{"sheet":"☆複数申請者","index":3,"n_rows":23,"n_cols":36,"rows_kept":23,"cut":false,"hidden":false,"merged":[[19,12,20,29],[21,12,21,29],[21,30,22,30],[22,12,22,29],[16,30,17,30],[17,12,17,29],[14,12,15,29],[16,12,16,29],[0,0,0,33],[9,12,10,29],[11,12,11,29],[11,30,12,30],[12,12,12,29],[1,0,1,33]]}
["現金取得者向け新築対象住宅証明書審査申請　（複数申請者）"]
["（すまい給付金）"]
[]
[]
[]
[]
[]
[null,null,"複数申請者の概要"]
[]
[null,null,"申請者２",null,null,null,null,null,null,null,"住所",null,{"$f":"IF(AJ10=0,\"\",AJ10)","v":""},null,null,null,null,null,null,null,null,null,null,null,null,null,null,null,null,null,null,null,null,null,null,{"$f":"IF(入力シート!I35=\"\",I!I206,入力シート!I35)","v":0}]
[]
[null,null,null,null,null,null,null,null,null,null,"氏名",null,{"$f":"IF(AJ12=0,\"\",AJ12)","v":""},null,null,null,null,null,null,null,null,null,null,null,null,null,null,null,null,null,null,null,null,null,null,{"$f":"IF(入力シート!I33=\"\",I!I203,入力シート!I33)","v":0}]
[null,null,null,null,null,null,null,null,null,null,null,null,{"$f":"IF(AJ13=0,\"\",AJ13)","v":""},null,null,null,null,null,null,null,null,null,null,null,null,null,null,null,null,null,null,null,null,null,null,{"$f":"IF(入力シート!I34=\"\",I!I204,入力シート!I34)","v":0}]
[]
[null,null,"申請者３",null,null,null,null,null,null,null,"住所",null,{"$f":"IF(AJ15=0,\"\",AJ15)","v":""},null,null,null,null,null,null,null,null,null,null,null,null,null,null,null,null,null,null,null,null,null,null,{"$f":"IF(入力シート!I40=\"\",I!I214,入力シート!I40)","v":0}]
[]
[null,null,null,null,null,null,null,null,null,null,"氏名",null,{"$f":"IF(AJ17=0,\"\",AJ17)","v":""},null,null,null,null,null,null,null,null,null,null,null,null,null,null,null,null,null,null,null,null,null,null,{"$f":"IF(入力シート!I38=\"\",I!I211,入力シート!I38)","v":0}]
[null,null,null,null,null,null,null,null,null,null,null,null,{"$f":"IF(AJ18=0,\"\",AJ18)","v":""},null,null,null,null,null,null,null,null,null,null,null,null,null,null,null,null,null,null,null,null,null,null,{"$f":"IF(入力シート!I39=\"\",I!I212,入力シート!I39)","v":0}]
[]
[null,null,"申請者４",null,null,null,null,null,null,null,"住所",null,{"$f":"IF(AJ20=0,\"\",AJ20)","v":""},null,null,null,null,null,null,null,null,null,null,null,null,null,null,null,null,null,null,null,null,null,null,{"$f":"IF(入力シート!I45=\"\",I!I222,入力シート!I45)","v":0}]
{"$rows_left_out":4}
{"sheet":"I","index":4,"n_rows":241,"n_cols":33,"rows_kept":241,"cut":false,"hidden":true,"merged":[]}
[]
[]
[]
[]
[]
[]
[]
[]
[]
[]
[]
[]
[]
[]
[]
[]
[]
[]
[]
[]
{"$rows_left_out":222}
{"sheet":"DATA","index":5,"n_rows":347,"n_cols":48,"rows_kept":347,"cut":false,"hidden":true,"merged":[[0,6,1,6],[0,0,2,0],[0,1,2,1],[0,2,2,2],[0,3,2,3],[0,5,2,5],[0,4,2,4],[0,7,1,7],[0,8,1,8],[0,12,0,13],[0,14,0,30],[1,14,1,18],[1,47,2,47],[1,31,1,35],[0,9,1,9],[1,40,1,43],[0,10,1,11],[1,19,1,23],[0,31,0,46],[1,30,2,30]]}
["№","県\nコード","都道府県名","市町村\nコード","群\n(新旧含む)","市町村名","地域の区分","年間\n日射量地域区分","暖房期\n日射量地域区分","基準風速","積雪",null,"所管行政庁\n（未記入は県）",null,"長期優良住宅",null,null,null,null,null,null,null,null,null,null,null,null,null,null,null,null,"低炭素建築物",null,null,null,null,null,null,null,null,null,null,null,null,null,null,null,"地域別追加料金"]
[null,null,null,null,null,null,null,null,null,null,null,null,"１～３号","４号","審査項目",null,null,null,null,"居住環境配慮基準",null,null,null,null,"都計法\n第４条第４項","都計法\n第４条第６項","都計法\n第４条第７項","都計法\n第４条第８項","住宅地区改良法\n第２条第３項",null,"技術的審査料金\n区分","審査項目",null,null,null,null,"区域制限","都計法\n第12条","都計法\n第34条","都計法\n第45条","都市の緑地保全への配慮",null,null,null,null,null,null,"数字:都市計画区域の判断あり"]
[null,null,null,null,null,null,"[地域]","[区分]","[区分]","[m/s]","[cm]","多雪地域","特定\n行政庁","限定特定\n行政庁","長期使用構造等","住宅規模","居住環境配慮基準","維持保全計画","資金計画","地区計画等","景観計画","建築協定","景観協定","景観法\nに基づ\nかない\n景観に\n関する 条 例 ","促進区域","都市計画施設の区域","市街地再開発事業の区域","市街地開発事業等予定区域","改良地区",null,null,"外皮性能","一次エネルギー消費量","その他の措置","基本的な方針","資金計画","用途地域","特別緑地保全地区制度","緑化地域制度","緑化協定制度","生産緑地地区","建築協定","緑地保全に関する市町村条例","都市施設緑地"]
[1,21,"岐阜県",21,null,"岐阜県",null,null,null,null,null,null,"岐阜県","岐阜県","■","■","■","■","■",null,null,null,null,null,null,null,null,null,null,null,"イ","■","■","■","■","■"]
[2,21,"岐阜県",201,null,"岐阜市（旧岐阜市)",6,"A4","H4",34,40,null,"岐阜市","岐阜市","■","■","■","■","■","○","○",null,null,null,null,null,null,null,null,null,"イ","■","■","■","■","■"]
[19,21,"岐阜県",201,"羽島郡","岐阜市（旧柳津町)",6,"A4","H4",34,30,null,"岐阜市","岐阜市","■","■","■","■","■","○","○",null,null,null,null,null,null,null,null,null,"イ","■","■","■","■","■"]
[3,21,"岐阜県",202,null,"大垣市（旧大垣市)",6,"A4","H4",34,45,null,"大垣市","大垣市","■","■","■","■","■","○","○",null,null,null,null,null,null,null,null,null,"イ","■","■","■","■","■",null,null,null,null,null,null,null,null,null,null,null,1]
[24,21,"岐阜県",202,"養老郡","大垣市（旧上石津町)",5,"A4","H1",34,100,null,"大垣市","大垣市","■","■","■","■","■","○","○",null,null,null,null,null,null,null,null,null,"イ","■","■","■","■","■",null,null,null,null,null,null,null,null,null,null,null,1]
[30,21,"岐阜県",202,"安八郡","大垣市（旧墨俣町)",6,"A4","H4",34,40,null,"大垣市","大垣市","■","■","■","■","■","○","○",null,null,null,null,null,null,null,null,null,"イ","■","■","■","■","■",null,null,null,null,null,null,null,null,null,null,null,1]
[4,21,"岐阜県",203,null,"高山市（旧高山市)",4,"A3","H4",null,120,"○",null,"高山市","■","■","■","■","■","○","○",null,null,null,null,null,null,null,null,null,"イ","■","■","■","■","■",null,null,null,null,null,null,null,null,null,null,null,"C"]
[87,21,"岐阜県",203,"大野郡","高山市（旧丹生川村)",4,"A3","H4",null,150,"○",null,"高山市","■","■","■","■","■","○","○",null,null,null,null,null,null,null,null,null,"イ","■","■","■","■","■",null,null,null,null,null,null,null,null,null,null,null,"C"]
[88,21,"岐阜県",203,"大野郡","高山市（旧清見村)",4,"A3","H4",null,190,"○",null,"高山市","■","■","■","■","■","○","○",null,null,null,null,null,null,null,null,null,"イ","■","■","■","■","■",null,null,null,null,null,null,null,null,null,null,null,"C"]
[89,21,"岐阜県",203,"大野郡","高山市（旧荘川村)",4,"A3","H4",null,260,"○",null,"高山市","■","■","■","■","■","○","○",null,null,null,null,null,null,null,null,null,"イ","■","■","■","■","■",null,null,null,null,null,null,null,null,null,null,null,"C"]
[91,21,"岐阜県",203,"大野郡","高山市（旧宮村)",4,"A3","H4",null,120,"○",null,"高山市","■","■","■","■","■","○","○",null,null,null,null,null,null,null,null,null,"イ","■","■","■","■","■",null,null,null,null,null,null,null,null,null,null,null,"C"]
[92,21,"岐阜県",203,"大野郡","高山市（旧久々野町)",4,"A3","H4",null,120,"○",null,"高山市","■","■","■","■","■","○","○",null,null,null,null,null,null,null,null,null,"イ","■","■","■","■","■",null,null,null,null,null,null,null,null,null,null,null,"C"]
[93,21,"岐阜県",203,"大野郡","高山市（旧朝日村)",4,"A3","H4",null,120,"○",null,"高山市","■","■","■","■","■","○","○",null,null,null,null,null,null,null,null,null,"イ","■","■","■","■","■",null,null,null,null,null,null,null,null,null,null,null,"C"]
[94,21,"岐阜県",203,"大野郡","高山市（旧高根村)",4,"A3","H4",null,170,"○",null,"高山市","■","■","■","■","■","○","○",null,null,null,null,null,null,null,null,null,"イ","■","■","■","■","■",null,null,null,null,null,null,null,null,null,null,null,"C"]
[96,21,"岐阜県",203,"吉城郡","高山市（旧国府町)",4,"A3","H4",null,140,"○",null,"高山市","■","■","■","■","■","○","○",null,null,null,null,null,null,null,null,null,"イ","■","■","■","■","■",null,null,null,null,null,null,null,null,null,null,null,"C"]
[100,21,"岐阜県",203,"吉城郡","高山市（旧上宝村)",4,"A3","H4",null,250,"○",null,"高山市","■","■","■","■","■","○","○",null,null,null,null,null,null,null,null,null,"イ","■","■","■","■","■",null,null,null,null,null,null,null,null,null,null,null,"C"]
[5,21,"岐阜県",204,null,"多治見市（旧多治見市)",6,"A4","H2",32,30,null,null,"多治見市","■","■","■","■","■","○","○","△",null,null,null,null,null,null,null,null,"イ","■","■","■","■","■"]
{"$rows_left_out":328}
{"sheet":"項目リスト","index":6,"n_rows":69,"n_cols":22,"rows_kept":69,"cut":false,"hidden":true,"merged":[]}
["確認申請ファイルファージョン","申請書",null,null,null,null,null,null,null,null,null,null,null,null,null,"工事届",null,"住まい給付金"]
["Ver","資格","一級","二級","木造","施工者","事務所登録","作成図書","判定機関","判定機関所在地","用途地域","建物構造","用途区分（建築物）","名称（建築物）","特定工程","主要用途工事届１","主要用途工事届２","住宅性能","確認申請","確認済証","評価書等","住宅の建て方"]
["2021/01/01 Ver.13.0","一級","大臣","愛知県知事","愛知県知事","なし","愛知県",null,"㈱建築構造センター","愛知県名古屋市中区","第一種低層住居専用地域",null,"08010","一戸建ての住宅","屋根ふき工事及び構造耐力上主要な軸組（枠組壁工法の場合は、耐力壁）の工事","01",11,"断熱等性能等級の等級４","当センターに申請済","確認建築愛建住セ","設計住宅性能評価書","一戸建ての住宅"]
["2020/09/07 Ver.12.0","二級",null,"岐阜県知事","岐阜県知事","大臣","岐阜県","設計図書一式","㈱確認サービス","愛知県名古屋市中区","第二種低層住居専用地域","木造","08020","長屋","鉄骨造の部分において、初めて工事を施工する階の建方工事","02",12,"一次エネルギー消費量等級４以上","当センターに申請予定","確変建築愛建住セ","長期優良住宅建築等計画に係る技術的審査適合証","共同住宅等"]
["2020/04/17 Ver.11.0","木造",null,"三重県知事","三重県知事","愛知県知事","三重県","設計図書（意匠図）","㈱東京建築検査機構","愛知県名古屋市中区","第一種中高層住居専用地域","在来木造","08030","共同住宅","RC造の部分において、初めて工事を施工する階の直上の階の主要構造部である床版の配筋（プレキャストコンクリート部材にあっては、接合部）の工事","03",13,"劣化対策等級３で、かつ、維持管理対策等級２以上（共同住宅等については一定の更新対策が必要）","他機関に申請済み（確認済証を添付）",null,"住宅性能証明書"]
["2019/07/17 Ver.10.0",null,null,"静岡県知事","静岡県知事","岐阜県知事","静岡県","設計図書(構造図）","㈱グッド・アイズ建築検査機構","東京都新宿区","第二種中高層住居専用地域","木造（枠組壁工法）","08040","寄宿舎","2階の床及びこれを支持するはりに鉄筋を配置する工事","04",14,"耐震等級（構造躯体の倒壊等防止）の等級２",null,null,"低炭素建築物新築等計画に係る技術的審査適合証"]
["2019/05/01 Ver.9.2",null,null,"愛媛県知事","愛媛県知事","三重県知事","愛媛県","設計図書（構造計算書）","(一財)日本建築センター　本部","東京都千代田区","第一種住居地域","丸太組構法","08050","下宿","構造耐力上主要な軸組を構成する各部材を接続する接合部の工事","05",15,"耐震等級（構造躯体の倒壊等防止）の等級３",null,null,"BELS評価書"]
["2018/10/26 Ver.9.1",null,null,"茨城県知事","茨城県知事","静岡県知事","茨城県",null,"(一財)日本建築センター　大阪事務所","大阪府大阪市中央区","第二種住居地域","木質系パネル造","08060","住宅で事務所、店舗その他これらに類する用途を兼ねるもの",null,null,16,"免震建築物",null,null,"性能向上計画認定技術的審査又は認定表示に係る認定技術的審査適合証"]
["2018/09/25 Ver.9.0",null,null,"岡山県知事","岡山県知事","愛媛県知事","岡山県",null,"(一財)ベターリビング　本部","東京都千代田区","準住居地域","鉄骨造","08070","幼稚園",null,null,17,"高齢者等配慮対策等級３以上の住宅",null,null,"フラット35S適合証明書"]
["2017/04/01 Ver.8.0",null,null,"沖縄県知事","沖縄県知事","茨城県知事","沖縄県",null,"(一財)ベターリビング　名古屋事務所","愛知県名古屋市中区","近隣商業地域","鉄筋コンクリート造","08080","小学校",null,null,18]
["2016/10/01 Ver.7.0",null,null,"岩手県知事","岩手県知事","岡山県知事","岩手県",null,"(一財)日本建築設備・昇降機センター","東京都港区","商業地域","鉄骨鉄筋コンクリート造","08090","中学校又は高等学校",null,null,19]
["2016/6/10 Ver.6.9",null,null,"宮崎県知事","宮崎県知事","沖縄県知事","宮崎県",null,"(一財)住宅金融普及協会","東京都文京区","準工業地域","壁式鉄筋コンクリート造","08100","養護学校、盲学校又は聾学校",null,null,20]
["2019/05/01 Ver.9.2",null,null,"宮城県知事","宮城県知事","岩手県知事","宮城県",null,null,null,"工業地域","プレキャストコンクリート造","08110","大学又は高等専門学校",null,null,21]
[null,null,null,"京都府知事","京都府知事","宮崎県知事","京都府",null,null,null,"工業専用地域",null,"08120","専修学校",null,null,22]
[null,null,null,"熊本県知事","熊本県知事","宮城県知事","熊本県",null,null,null,"指定なし",null,"08130","各種学校",null,null,23]
[null,null,null,"群馬県知事","群馬県知事","京都府知事","群馬県",null,null,null,null,null,"08132","幼保連携型認定こども園",null,null,24]
[null,null,null,"広島県知事","広島県知事","熊本県知事","広島県",null,null,null,null,null,"08140","図書館その他これらに類するもの",null,null,25]
[null,null,null,"香川県知事","香川県知事","群馬県知事","香川県",null,null,null,null,null,"08150","博物館その他これらに類するもの",null,null,26]
[null,null,null,"高知県知事","高知県知事","広島県知事","高知県",null,null,null,null,null,"08160","神社、寺院、教会その他これらに類するもの",null,null,27]
[null,null,null,"佐賀県知事","佐賀県知事","香川県知事","佐賀県",null,null,null,null,null,"08170","老人ホーム、身体障害者福祉ホームその他これに類するもの",null,null,28]
{"$rows_left_out":49}